{"text_format":"1","workbook":"xlsx","n_sheets":9,"sheets":["Survey Set-Up","Instructions","Instructions ","DSH Waiver & MIUR Data","Variance","Sec. A-C DSH Year Data","Checklist","Sec. A-C DSH Year Data ADJ","Exam Adjustments"],"not_rendered":{"charts":0,"images":0,"macros":1,"external_links":0,"defined_names":149,"comments":0,"pivot_tables":0},"unopened":[],"bounds":{"document_bytes":16777216,"sheet_cells":100000,"rows_first":2000,"rows_last":500,"rows_between":2000,"halvings":0,"cell_chars":16384,"cell_head_chars":4096},"cells_cut":0,"cells_raw":0,"read":"whole","date_system":"1900"}

{"sheet":"Survey Set-Up","index":0,"n_rows":218,"n_cols":21,"rows_kept":218,"cut":false,"hidden":true,"merged":[[5,3,6,8],[217,0,217,13],[9,7,9,8]]}
["State:","Georgia",null,"Year:",2017,null,"Including Section L (provider tax form) in Part II?",null,null,null,"Yes",null,null,null,null,null,null,null,null,null,"I hereby certify that the information in Sections A, B, C, D, E, F, G, H, I, J, K and L of the DSH Survey files are true and accurate to the best of our ability, and supported by the financial and other records of the hospital.  All Medicaid eligible patients, including those who have private insurance coverage, have been reported on the DSH survey regardless of whether the hospital received payment on the claim.  I understand that this information will be used to determine the Medicaid program's compliance with federal Disproportionate Share Hospital (DSH) eligibility and payments provisions.  Detailed support exists for all amounts reported in the survey.  These records will be retained for a period of not less than 5 years following the due date of the survey, and will be made available for inspection when requested.  "]
[null,null,null,null,null,null,null,null,null,null,null,null,null,null,null,null,null,null,null,null,"I hereby certify that the information in Sections A, B, C, D, E, F, G, H, I, J, and K of the DSH Survey files are true and accurate to the best of our ability, and supported by the financial and other records of the hospital.  All Medicaid eligible patients, including those who have private insurance coverage, have been reported on the DSH survey regardless of whether the hospital received payment on the claim.  I understand that this information will be used to determine the Medicaid program's compliance with federal Disproportionate Share Hospital (DSH) eligibility and payments provisions.  Detailed support exists for all amounts reported in the survey.  These records will be retained for a period of not less than 5 years following the due date of the survey, and will be made available for inspection when requested.  "]
[null,"Submission Information  (Flows to Checklist Sheet)",null,"Are you using the Myers and Stauffer DSH Web Portal?",null,null,null,null,"Yes"]
[null,"Myers and Stauffer LC"]
[null,"ATTN:  DSH Examinations"]
[null,"700 W. 47th Street, Suite 1100",null,"After entering state, click on \"Run page setup\" below to set-up the headers and footers with the state name and year (in all sheets).  This is a slow process so be patient!"]
[null,"Kansas City, Missouri 64112"]
[null,"Fax:  (816) 945-5301"]
[null,"Phone:  (800) 374-6858"]
[null,"E-Mail: ",null,null,null,null,null,"Output Directory:",null,"G:\\Data\\State Data\\Georgia\\Georgia DSH Project\\2019 DSH Project\\Survey Part I\\"]
[]
[null,1,2,3,4,5,6,7,8,9,10,11]
[null,"Hospital Name","Medicaid Provider ID","Medicaid SubProvider1 ID","Medicaid SubProvider2 ID","Medicare Provider ID","Report Period From","Reporting Period To","Report Period From","Reporting Period To","Report Period From","Reporting Period To"]
[null,"SELECT HOSPITAL NAME","M'Caid #","M'caid Sub 1 #","M'caid Sub 2 #","M'care #"]
[1,"HAMILTON MEDICAL CENTER             ","000000899A",null,null,110001,"2016-10-01","2017-09-30"]
{"$rows_left_out":204}
{"sheet":"Instructions","index":1,"n_rows":24,"n_cols":3,"rows_kept":24,"cut":false,"hidden":false,"merged":[[24,0,24,2],[23,0,23,2]]}
["A. General Instructions and Identification of Cost Reports that Cover the DSH Year:"]
[]
["1.",null,"Select the \"Sec. A-C DSH Year Data\" tab in Excel workbook.  In row 1, select your facility from the drop-down menu provided (if not already populated).  When your facility is selected, the following fields will be populated: in-state Medicaid provider number and Medicare provider number.  Review information and indicate whether it is correct or incorrect.  If incorrect, provide correct information."]
[]
["2.",null,"Provide your cost reporting periods that are needed to completely cover the DSH year.  If the end date for cost report period 1 is before the end date of the DSH year, report your next cost reporting period (cost report 2).  If this cost report ends prior to the end of the DSH year, report your next cost reporting period (cost report 3).  The cost reporting periods must cover the entire DSH year. "]
[null,null,"NOTE:  For the 2015 DSH Survey, if your hospital completed the DSH survey for 2014, the first cost report year should follow the last cost report year reported on the 2014 DSH survey.  The last cost report year on the 2015 survey must end on or after the end of the 2015 DSH year.  If your hospital did not complete the 2014 survey, your cost reports for 2015 must cover the entire 2015 DSH year."]
[]
["3.",null,"Supporting documentation for all data elements provided within the DSH survey must be maintained for a minimum of five years from the date of survey submission."]
["B. DSH OB Qualifying Information:"]
[]
["1.",null,"Answer \"B. DSH OB Qualifying Information\" questions 1, 2 and 3 to determine if your hospital is eligible to receive DSH payments."]
[]
["C. Disclosure of Other Medicaid Payments Received:"]
[]
["1.",null,"Medicaid supplemental payments should include UPL and Non-Claim Specific payments paid based on the state fiscal year. However, DSH payments should NOT be included."]
{"$rows_left_out":10}
{"sheet":"Instructions ","index":2,"n_rows":28,"n_cols":3,"rows_kept":28,"cut":false,"hidden":true,"merged":[[27,0,27,2],[28,0,28,2]]}
["DSH Waiver & MIUR Data"]
[]
[{"$f":"IF(State=\"Missouri\",1,\"\")","v":""},null,"A DSH Waiver & MIUR Data form is included in DSH Survey Part I. A hospital that did not receive an interim DSH payment for the year under examination and elects not to receive a Missouri Medicaid interim DSH payment for the upcoming interim DSH payment year must complete the DSH Waiver & MIUR Data form and indicate it elects not to receive an interim DSH payment.  The hospital must also complete the “Days” section on the DSH Waiver & MIUR Data form so the hospital’s MIUR may be calculated. However, the remainder of DSH Year Survey Part I and all of DSH Year Survey Part II do not need to be completed.  CMS requires the state of Missouri to submit the MIUR for each hospital in the state that receives a Medicaid payment.  It is important that the “Days” section is completed so the MIUR can be accurately reported to CMS as the MIUR data may affect future federal funding.    "]
[]
["A. General Instructions and Identification of Cost Reports that Cover the DSH Year:"]
[]
["1.",null,"Select the \"Sec. A-C DSH Year Data\" tab in Excel workbook.  In row 1, select your facility from the drop-down menu provided (if not already populated).  When your facility is selected, the following fields will be populated: in-state Medicaid provider number and Medicare provider number.  Review information and indicate whether it is correct or incorrect.  If incorrect, provide correct information."]
[]
["2.",null,"Provide your cost reporting periods that are needed to completely cover the DSH year.  If the end date for cost report period 1 is before the end date of the DSH year, report your next cost reporting period (cost report 2).  If this cost report ends prior to the end of the DSH year, report your next cost reporting period (cost report 3).  The cost reporting periods must cover the entire DSH year. "]
[null,null,"NOTE:  For the 2015 DSH Survey, if your hospital completed the DSH survey for 2014, the first cost report year should follow the last cost report year reported on the 2014 DSH survey.  The last cost report year on the 2015 survey must end on or after the end of the 2015 DSH year.  If your hospital did not complete the 2014 survey, your cost reports for 2015 must cover the entire 2015 DSH year."]
[]
["3.",null,"Supporting documentation for all data elements provided within the DSH survey must be maintained for a minimum of five years from the date of survey submission."]
["B. DSH OB Qualifying Information:"]
[]
["1.",null,"The “Sec. A-C DSH Year Data” tab of DSH Year Survey Part I, Section B. DSH OB Qualifying Information, has two sets of OB questions. The first set of OB questions relates to the interim DSH payments which are the subject of the federal DSH examination. The second set of OB questions relates to the interim DSH payments for the upcoming SFY interim DSH payment calculation. You must complete the first set of OB questions if you are required to participate in the DSH examination. You must complete the second set of OB questions if you are electing to participate in the upcoming SFY interim DSH payment calculation."]
{"$rows_left_out":14}
{"sheet":"DSH Waiver & MIUR Data","index":3,"n_rows":83,"n_cols":10,"rows_kept":83,"cut":false,"hidden":true,"merged":[[14,1,14,6],[38,2,38,3],[5,4,5,6],[66,1,66,6],[28,1,28,8],[29,1,29,8],[30,1,30,8],[21,1,21,7],[50,1,50,6],[51,1,51,6]]}
[]
["DSH Waiver & MIUR Data Form"]
[]
["General Information & DSH Waiver"]
[]
[1,"Hospital Name",null,null,{"$f":"HOSPITALNAME_ADJ","v":"WELLSTAR WEST GEORGIA HOSPITAL      "}]
[]
[2,"Missouri Medicaid Provider Number:",null,null,{"$f":"McaidNum_ADJ","v":"000002065A"}]
[]
[]
[3,"Medicare Provider Number:",null,null,{"$f":"McareNum_ADJ","v":110016}]
[]
[4,"DSH Payment Year:",null,"From:","2018-07-01","To:","2019-06-30"]
[]
[null,{"$f":"CONCATENATE(\"Based on the hospital's projections, the above named hospital does not anticipate it will have uncompensated cost of care for Medicaid and the uninsured that would be eligible for an interim DSH payment for SFY \",YEAR($G$13),\".  Therefore, this hospital elects not to receive an interim DSH payment for SFY \",YEAR($G$13),\".\")","v":"Based on the hospital's projections, the above named hospital does not anticipate it will have uncompensated cost of care for Medicaid and the uninsured that would be eligible for an interim DSH payment for SFY 2019.  Therefore, this hospital elects not to receive an interim DSH payment for SFY 2019."}]
{"$rows_left_out":69}
{"sheet":"Variance","index":4,"n_rows":4,"n_cols":1,"rows_kept":4,"cut":false,"hidden":true,"merged":[[3,1,16,12]]}
[]
["Please explain variances below."]
[]
[13]

{"sheet":"Sec. A-C DSH Year Data","index":5,"n_rows":103,"n_cols":29,"rows_kept":103,"cut":false,"hidden":false,"merged":[[102,2,102,5],[16,2,16,4],[100,9,100,12],[65,1,65,4],[101,9,101,12],[99,2,99,5],[97,9,97,12],[101,2,101,5],[100,2,100,5],[99,9,99,12],[88,4,88,6],[5,2,5,6],[64,1,64,4],[11,6,11,13],[12,6,12,13],[98,9,98,12],[97,2,97,5],[98,2,98,5],[83,1,83,13],[81,2,81,13],[82,1,82,13],[53,1,53,4],[54,1,54,4],[13,6,13,13],[91,4,91,6],[91,8,91,10],[86,1,86,10]]}
[null,null,null,null,null,null,null,null,"DSH Version",null,5.2,null,"2017-11-01",null,null,null,null,null,null,null,null,null,null,null,null,null,null,null,{"$f":"State","v":"Georgia"}]
["A.  General DSH Year Information",null,null,null,null,null,null,null,null,null,null,null,null,null,null,null,null,null,null,null,null,null,null,null,null,null,null,null,{"$f":"Waiver_Response","v":"No"}]
[null,null,"Begin",null,"End"]
["1.","DSH Year:","2016-07-01",null,"2017-06-30"]
[]
["2.","Select Your Facility from the Drop-Down Menu Provided:","WELLSTAR WEST GEORGIA HOSPITAL      "]
[]
[]
[null,"Identification of cost reports needed to cover the DSH Year:"]
[null,null,"Cost Report",null,"Cost Report"]
[null,null,"Begin Date(s)",null,"End Date(s)"]
["3.","Cost Report Year 1",{"$f":"IF(VLOOKUP(HOSPITALNAME,DATATABLE,6,FALSE)=0,\"\",VLOOKUP(HOSPITALNAME,DATATABLE,6,FALSE))","v":"2016-07-01"},null,{"$f":"IF(VLOOKUP(HOSPITALNAME,DATATABLE,7,FALSE)=0,\"\",VLOOKUP(HOSPITALNAME,DATATABLE,7,FALSE))","v":"2017-06-30"},null,{"$f":"IF(ISNUMBER(FYE_1),\"Must also complete a separate survey file for each cost report period listed - SEE DSH SURVEY PART II FILES\", \"\")","v":"Must also complete a separate survey file for each cost report period listed - SEE DSH SURVEY PART II FILES"}]
["4.","Cost Report Year 2 (if applicable)",{"$f":"IF(VLOOKUP(HOSPITALNAME,DATATABLE,8,FALSE)=0,\"\",VLOOKUP(HOSPITALNAME,DATATABLE,8,FALSE))","v":""},null,{"$f":"IF(VLOOKUP(HOSPITALNAME,DATATABLE,9,FALSE)=0,\"\",VLOOKUP(HOSPITALNAME,DATATABLE,9,FALSE))","v":""},null,{"$f":"IF(ISNUMBER(FYE_2),\"Must also complete a separate survey file for each cost report period listed - SEE DSH SURVEY PART II FILES\", \"\")","v":""}]
["5.","Cost Report Year 3 (if applicable)",{"$f":"IF(VLOOKUP(HOSPITALNAME,DATATABLE,10,FALSE)=0,\"\",VLOOKUP(HOSPITALNAME,DATATABLE,10,FALSE))","v":""},null,{"$f":"IF(VLOOKUP(HOSPITALNAME,DATATABLE,11,FALSE)=0,\"\",VLOOKUP(HOSPITALNAME,DATATABLE,11,FALSE))","v":""},null,{"$f":"IF(ISNUMBER(FYE_3),\"Must also complete a separate survey file for each cost report period listed - SEE DSH SURVEY PART II FILES\", \"\")","v":""}]
[]
{"$rows_left_out":89}
{"sheet":"Checklist","index":6,"n_rows":41,"n_cols":8,"rows_kept":41,"cut":false,"hidden":false,"merged":[[40,4,40,14],[18,4,18,14],[32,4,32,13],[16,4,16,14],[23,4,23,14],[21,4,21,14],[22,4,22,14],[25,4,25,14],[24,4,24,14],[17,4,17,14],[19,4,19,14],[20,5,20,14],[15,4,15,14],[31,4,31,13],[7,5,7,14],[13,5,13,14],[12,4,12,14],[2,4,2,14],[30,4,30,13],[10,5,10,14],[27,4,27,14],[1,1,1,14],[26,4,26,14],[8,4,8,14],[11,4,11,14],[14,4,14,14],[6,1,7,1],[9,1,10,1],[12,1,13,1],[19,1,20,1],[3,4,3,14],[4,4,4,14],[5,4,5,14]]}
["DSH Survey Submission Checklist"]
[null,"Please indicate with an \"X\" each item included or a \"N/A\" if not included.  Consider a separate cover letter to explain any \"N/A\" answers to avoid additional documentation requests."]
[null,"X",null,"1.",{"$f":"CONCATENATE(\"Electronic copy of the DSH Survey Part I - DSH Year Data -  \", TEXT(DSH_Year_Begin,\"mm/dd/yyyy\"), \" - \", TEXT(DSH_Year_End,\"mm/dd/yyyy\"))","v":"Electronic copy of the DSH Survey Part I - DSH Year Data -  07/01/2016 - 06/30/2017"}]
[null,"X",null,"2.",{"$f":" CONCATENATE(\"Electronic copy of the DSH Survey Part II - Cost Report Data - Cost Report Year \", TEXT(FYB_1,\"mm/dd/yyyy\"), \" - \", TEXT(FYE_1,\"mm/dd/yyyy\"))","v":"Electronic copy of the DSH Survey Part II - Cost Report Data - Cost Report Year 07/01/2016 - 06/30/2017"}]
[null,"N/A",null,"3.",{"$f":"IF(ISNUMBER('Sec. A-C DSH Year Data'!E13),CONCATENATE(\"Electronic copy of the DSH Survey Part II - Cost Report Data - Cost Report Year \", TEXT(FYB_2,\"mm/dd/yyyy\"), \" - \", TEXT(FYE_2,\"mm/dd/yyyy\")),\"N/A\")","v":"N/A"}]
[null,"N/A",null,"4.",{"$f":"IF(ISNUMBER('Sec. A-C DSH Year Data'!E14),CONCATENATE(\"Electronic copy of the DSH Survey Part II - Cost Report Data - Cost Report Year \", TEXT(FYB_3,\"mm/dd/yyyy\"), \" - \", TEXT(FYE_3,\"mm/dd/yyyy\")),\"N/A\")","v":"N/A"}]
[null,"X",null,"5 (a).","Electronic copy of Exhibit A - Uninsured Charges / Days"]
[null,null,null,null,null,"- Must be in Excel (.xls or .xlsx) or CSV (.csv) using either a TAB or | (pipe symbol above the ENTER key)"]
[null,null,null,"5 (b).","Description of logic used to compile Exhibit A.  Include a copy of all financial classes and payor plan codes utilized during the cost report period and a description of which codes were included or excluded if applicable."]
[null,"X",null,"6 (a).","Electronic copy of Exhibit B - Self-Pay Payments"]
[null,null,null,null,null,"- Must be in Excel (.xls or .xlsx) or CSV (.csv) using either a TAB or | (pipe symbol above the ENTER key)."]
[null,null,null,"6 (b).","Description of logic used to compile Exhibit B. Include a copy of all transaction codes utilized to post payments during the cost reporting period and a description of which codes were included or excluded if applicable."]
[null,"X",null,"7 (a).","Electronic copy of Exhibit C for hospital-generated data (includes Medicaid eligibles, Medicare crossover, Medicaid MCO, or Out-Of-State Medicaid data that isn't supported by a state-provided or MCO-provided report)"]
[null,null,null,null,null,"- Must be in Excel (.xls or .xlsx) or CSV (.csv) using either a TAB or | (pipe symbol above the ENTER key)."]
[null,null,null,"7 (b).","Description of logic used to compile each Exhibit C. Include a copy of all financial classes and payor plan codes utilized during the cost report period and a description of which codes were included or excluded if applicable."]
{"$rows_left_out":27}
{"sheet":"Sec. A-C DSH Year Data ADJ","index":7,"n_rows":103,"n_cols":31,"rows_kept":103,"cut":false,"hidden":true,"merged":[[102,2,102,5],[99,2,99,5],[99,9,99,12],[100,2,100,5],[100,9,100,12],[101,2,101,5],[101,9,101,12],[97,2,97,5],[97,9,97,12],[98,2,98,5],[98,9,98,12],[88,4,88,6],[91,4,91,6],[91,8,91,10],[82,1,82,13],[53,1,53,4],[54,1,54,4],[83,1,83,13],[86,1,86,10],[5,2,5,6],[16,2,16,4],[64,1,64,4],[65,1,65,4],[81,2,81,13]]}
[null,null,null,null,null,null,null,null,"DSH Version",null,{"$f":"Version","v":5.2},null,{"$f":"'Sec. A-C DSH Year Data'!M1","v":"2017-11-01"},null,null,null,null,null,null,null,null,null,null,null,null,null,null,null,null,null,{"$f":"State","v":"Georgia"}]
["A.  General DSH Year Information",null,null,null,null,null,null,null,null,null,null,null,null,null,null,null,null,null,null,null,null,null,null,null,null,null,null,null,"IOWA",null,{"$f":"Waiver_Response","v":"No"}]
[null,null,"Begin",null,"End",null,null,null,"Workpaper #:",null,null,null,"Reviewer:",null,null,null,null,null,null,null,null,null,null,null,null,null,null,null,"ARIZONA "]
["1.","DSH Year:",{"$f":"DSH_Year_Begin","v":"2016-07-01"},null,{"$f":"DSH_Year_End","v":"2017-06-30"},null,null,null,"Examiner:",null,null,null,null,null,null,null,null,null,null,null,null,null,null,null,null,null,null,null,"ARKANSAS"]
[null,null,null,null,null,null,null,null,"Date:"]
["2.","Select Your Facility from the Drop-Down Menu Provided:",{"$f":"HOSPITALNAME","v":"WELLSTAR WEST GEORGIA HOSPITAL      "},null,null,null,null,null,null,null,null,null,null,null,null,null,null,null,null,null,null,null,null,null,null,null,null,null,"ALABAMA"]
[null,null,null,null,null,null,null,null,null,null,null,null,null,null,null,null,null,null,null,null,null,null,null,null,null,null,null,null,"ALASKA"]
[null,null,null,null,null,null,null,null,null,null,null,null,null,null,null,null,null,null,null,null,null,null,null,null,null,null,null,null,"COLORADO "]
[null,"Identification of cost reports needed to cover the DSH Year:",null,null,null,null,null,null,null,null,null,null,null,null,null,null,null,null,null,null,null,null,null,null,null,null,null,null,"CONNECTICUT"]
[null,null,"Cost Report",null,"Cost Report"]
[null,null,"Begin Date(s)",null,"End Date(s)",null,null,null,null,null,null,null,null,null,null,null,null,null,null,null,null,null,null,null,null,null,null,null,"DELAWARE"]
["3.","Cost Report Year 1",{"$f":"FYB_1","v":"2016-07-01"},null,{"$f":"FYE_1","v":"2017-06-30"},null,null,null,null,null,null,null,null,null,null,null,null,null,null,null,null,null,null,null,null,null,null,null,"DISTRICT OF COLUMBIA"]
["4.","Cost Report Year 2 (if applicable)",{"$f":"FYB_2","v":""},null,{"$f":"FYE_2","v":""},null,null,null,null,null,null,null,null,null,null,null,null,null,null,null,null,null,null,null,null,null,null,null,"FLORIDA"]
["5.","Cost Report Year 3 (if applicable)",{"$f":"FYB_3","v":""},null,{"$f":"FYE_3","v":""},null,null,null,null,null,null,null,null,null,null,null,null,null,null,null,null,null,null,null,null,null,null,null,"GEORGIA"]
[]
{"$rows_left_out":89}
{"sheet":"Exam Adjustments","index":8,"n_rows":18,"n_cols":11,"rows_kept":18,"cut":false,"hidden":true,"merged":[[6,0,6,9],[2,2,2,7],[0,0,0,9],[5,0,5,10]]}
["Medicaid DSH Survey Adjustments"]
[]
["PROVIDER:",null,{"$f":"'Sec. A-C DSH Year Data ADJ'!C6:G6","v":"WELLSTAR WEST GEORGIA HOSPITAL      "},null,null,null,null,null,"Mcaid Number:",{"$f":"McaidNum_ADJ","v":"000002065A"}]
["FROM:",null,{"$f":"DSH_Year_Begin","v":"2016-07-01"},null,"TO:",{"$f":"DSH_Year_End","v":"2017-06-30"},null,null,"Mcare Number:",{"$f":"McareNum_ADJ","v":110016}]
[]
["Myers and Stauffer DSH Survey Adjustments"]
[]
["Adj. #","Schedule","Line #","Line Description","Column","Column Description","Year","Explanation for Adjustment","Original Amount","Adjustment","Adjusted Total"]
[null,"Certification",1,"Retain 100% of DSH Payment?","1.00","Answer",{"$f":"DSH_Year_End","v":"2017-06-30"},"Adjust answer based on examination results.",{"$f":"RetainDSHYes","v":"Yes"},{"$f":"IF(K9<>I9,K9,0)","v":0},{"$f":"RetainDSHYes_ADJ","v":"Yes"}]
[null,"B - DSH OB Qualifying Information",1,"Have two OBs?","1.00","Answer","2017-06-30","Adjust answer based on examination results.",{"$f":"OBYes","v":"Yes"},0,{"$f":"OBYes_ADJ","v":"Yes"}]
[null,"B - DSH OB Qualifying Information",2,"Exempt to OB due to inpatients under age 18?","1.00","Answer","2017-06-30","Adjust answer based on examination results.",{"$f":"OBExempt1Yes","v":"No"},0,{"$f":"OBExempt1Yes_ADJ","v":"No"}]
[null,"B - DSH OB Qualifying Information",3,"Exempt to OB due to not offering OB on 12/22/87?","1.00","Answer","2017-06-30","Adjust answer based on examination results.",{"$f":"OBExempt2Yes","v":"No"},0,{"$f":"OBExempt2Yes_ADJ","v":"No"}]
[null,"B - DSH OB Qualifying Information","3a","Was the hospital open as of 12/22/87?","1.00","Answer","2017-06-30","Adjust answer based on review results.",{"$f":"OpenAsOf_Exam","v":"Yes"},{"$f":"IF(K13<>I13,K13,0)","v":0},{"$f":"OpenAsOf_Exam_ADJ","v":"Yes"}]
[null,"B - DSH OB Qualifying Information","3b","Year Hospital opened?","1.00","Answer","2017-06-30","Adjust answer based on review results.",{"$f":"IF(OR(OpenDate_Exam=\"\",OpenDate_Exam=0),\"\",OpenDate_Exam)","v":"1966-07-01"},{"$f":"IF(K14<>I14,K14,0)","v":"00:00:00"},{"$f":"IF(OpenDate_Exam_ADJ=\"\",\"\",OpenDate_Exam_ADJ)","v":"1966-07-01"}]
[null,"B - DSH OB Qualifying Information",4,"Have two OBs?","1.00","Answer",{"$f":"DSH_Payment_Year_End","v":"2019-06-30"},"Adjust answer based on review results.",{"$f":"OBYes_Payment","v":"Yes"},0,{"$f":"OBYes_Payment_ADJ","v":"Yes"}]
{"$rows_left_out":3}